Create react app test failed see above for more details

images create react app test failed see above for more details

It also has the "snapshot testing" feature we'll be using here, which no other tools currently have. So, let's add a real snapshot test. At the bottom, you can see that there are a few commands you can issue. Jest will also help you manage your snapshots by telling you when they are no longer used, and you can easily clean them up by pressing the "u" key. By using our site, you acknowledge that you have read and understand our Cookie PolicyPrivacy Policyand our Terms of Service.

  • Having a problem running tests with npm test node
  • Snapshot Testing React Components with Jest Semaphore

  • After Ejecting. create-react-app myapp and cd into the directory; Run npm run eject; Run npm test or yarn test See above for more details. _errnoException () at ge (: ) npm ERR! Test failed. See above for more details. EMFILE at exports._errnoException () at her.

    ge () npm ERR! Test failed.

    images create react app test failed see above for more details

    See above for more details.
    Submit a new text post. We recommend thinking of snapshot testing as a tool in your arsenal -- just one tool. If you still have the test watcher running, it will fail because the content of App has changed.

    Having a problem running tests with npm test node

    Every snapshot comparison a call expect Once you have it working, you can take a "snapshot" of it -- you just need to copy and paste its HTML representation into a file.

    images create react app test failed see above for more details
    Create react app test failed see above for more details
    Known as dceddia around the Interwebs.

    NPM is running your test script under cmd. Inspecting the snapshot file will verify that it rendered a "2" for this test.

    Here is what the section looks like in package. Possible workaround aside from just using a proper Bash environment: Snapshot tests come close to offering this dreamy future.

    Hi, it says in the documentation that create-react-app uses jest. I tried using it When I import a component that uses absolute paths the test fails to run with. npm test throws errors in brand new CRA app 1) Create CRA@ app with react-app-rewired.

    cd /tmp npx See above for more details.

    . Test suite failed to run Cannot find module 'babel-preset-react-app' at Object. npm error: -watch is not supported without git/hg, please use --watchAll # Closed Failed at the chs-react-ts@ test script. npm ERR! This is When running the command described above, the test script is having the mentioned error. This error. Press h to open a hovercard with more details.
    It's not a solution to every testing situation, just like TDD isn't perfectly suited to every situation.

    If you're not familiar with them, don't worry: Jest will also help you manage your snapshots by telling you when they are no longer used, and you can easily clean them up by pressing the "u" key. Here we used the component. The full API can be seen here. By clicking "Post Your Answer", you acknowledge that you have read our updated terms of serviceprivacy policy and cookie policyand that your continued use of the website is subject to these policies.

    By using our site, you acknowledge that you have read and understand our Cookie PolicyPrivacy Policyand our Terms of Service.

    Video: Create react app test failed see above for more details Debugging a Create React App with VS Code

    images create react app test failed see above for more details
    FREE DATINGSITESFREE DATING BIBLE VERSES
    If you don't have an existing project, create one with Create React App and follow along:.

    An important consequence of the way snapshot tests work is that the component should work before you write a test for it. To comment you need to have a Semaphore account. In this article, we covered how to get set up with snapshot testing, write a few tests, and run them in the cloud on Semaphore. Semaphore will analyze the project, and should automatically choose npm test as the Job 1 command:.

    Sometimes we hit the limit on the number of files we can watch simultaneously and we gains the error while having plenty of free space.

    if you need them. They are beyond the scope of Create React App. When you run npm test, Jest will launch in the watch mode. Every time you save a file. The above contains code can be written more simply with jest-enzyme.

    expect( wrapper). If any warnings are encountered then the build fails.

    Popular CI servers. Sh jest command not found npm err test failed see above for more details. System Linux 3. js node_modules/@types/uuid/node_modules/@types/node npm ERR! Test. 26 npm ERR! npm -v 1. o /bin/sh: cc: command not found make [1]: *** [adlist.

    images create react app test failed see above for more details

    Sort By Name; Sort By Date; Ascending How to Test React Components.
    If you still have the test watcher running, it will fail because the content of App has changed. Having a problem running tests with "npm test" self.

    Snapshot Testing React Components with Jest Semaphore

    They have a cost, like any other code. So that nonsensical word in all caps at the end of the first line of every node error Arrow functions also preserve the "this" binding, but we're not making use of that capability here.

    Notice that we're not actually "clicking" the button itself, but rather calling the method directly.

    images create react app test failed see above for more details
    Best date night restaurants brisbane
    Notice that we're not actually "clicking" the button itself, but rather calling the method directly.

    It knows about your project dependency tree and uses that to intelligently reduce the amount of work it needs to do. Setup only takes a couple minutes, and it's free. Try them out in your own project. At this time, Jest doesn't seem to have good facilities for finding child components. For example, it will look for App.